Bgames
Olá visitante! Seja bem vindo ao nosso fórum!

Para você ter total acesso ao nosso fórum é preciso que você se cadastre.

Cadastre-se Aqui!


PARA VER LINKS E IMAGENS É PRECISO SE REGISTRAR!

[Resolvido][Dúvida] Erro na compilaçao

Ver o tópico anterior Ver o tópico seguinte Ir em baixo

[Resolvido][Dúvida] Erro na compilaçao

Mensagem por pedroh7 em Ter 3 Jun 2014 - 11:24

Erro na compilaçao
Quando tento compilar usando Cmake aparece isso 
CMake Error at CMakeLists.txt:12 (project):
Cannot enable 64-bit tools with Visual Studio 2010 Express.

Install the Microsoft Windows SDK v7.1 to get 64-bit tools:


[Você precisa estar registrado e conectado para ver este link.]
porem quando tento instalar esse arquivo aparece esse erro 


A problem occurred while installing selected Windows SDK components.

Installation of the "Microsoft Windows SDK for Windows 7" product has reported the following error: Please refer to Samples\Setup\HTML\ConfigDetails.htm document for further information.

Please attempt to resolve the problem and then start Windows SDK setup again. If you continue to have problems with this issue, please visit the SDK team support page at [Você precisa estar registrado e conectado para ver este link.]

Click the View Log button to review the installation log.
To exit, click Finish.


Última edição por paradox em Qua 4 Jun 2014 - 10:25, editado 1 vez(es) (Razão : Título - tag)

pedroh7


Mensagens : 42
Pontos : 105

Ver perfil do usuário

Voltar ao Topo Ir em baixo

Re: [Resolvido][Dúvida] Erro na compilaçao

Mensagem por Erictemponi em Ter 3 Jun 2014 - 17:02

Seu sistema operacional é de qual arquitetura? x86 ou x64?
E o seu processador?

Erictemponi


Mensagens : 1825
Pontos : 7296
Evolução : 2


Ver perfil do usuário http://www.fury-share.blogspot.com.br/

Voltar ao Topo Ir em baixo

Re: [Resolvido][Dúvida] Erro na compilaçao

Mensagem por pedroh7 em Qua 4 Jun 2014 - 8:01

agora quando tento configurar aparece isso.

Found Windows SDK v7.1: E:\Program Files\Microsoft SDKs\Windows\v7.1\
Check for working C compiler using: Visual Studio 10 Win64
Check for working C compiler using: Visual Studio 10 Win64 -- broken
CMake Error at C:/Program Files (x86)/CMake 2.8/share/cmake-2.8/Modules/CMakeTestCCompiler.cmake:52 (MESSAGE):
The C compiler "cl" is not able to compile a simple test program.

It fails with the following output:

Change Dir: C:/Users/pedro/Desktop/Servidor/Compilado/CMakeFiles/CMakeTmp



Run Build Command:C:\Windows\Microsoft.NET\Framework\v4.0.30319\MSBuild.exe
cmTryCompileExec.vcxproj /p:Configuration=Debug

Microsoft (R) Build Engine version 4.0.30319.34209

[Microsoft .NET Framework, version 4.0.30319.34209]

Copyright (C) Microsoft Corporation. All rights reserved.



Build started 04/06/2014 08:57:26.

Project
"C:\Users\pedro\Desktop\Servidor\Compilado\CMakeFiles\CMakeTmp\cmTryCompileExec.vcxproj"
on node 1 (default targets).

C:\Program Files
(x86)\MSBuild\Microsoft.Cpp\v4.0\Microsoft.Cpp.InvalidPlatform.Targets(23,7):
error MSB8007: The Platform for project 'cmTryCompileExec.vcxproj' is
invalid. Platform='x64'. You may be seeing this message because you are
trying to build a project without a solution file, and have specified a
non-default Platform that doesn't exist for this project.
[C:\Users\pedro\Desktop\Servidor\Compilado\CMakeFiles\CMakeTmp\cmTryCompileExec.vcxproj]


Done Building Project
"C:\Users\pedro\Desktop\Servidor\Compilado\CMakeFiles\CMakeTmp\cmTryCompileExec.vcxproj"
(default targets) -- FAILED.



Build FAILED.




"C:\Users\pedro\Desktop\Servidor\Compilado\CMakeFiles\CMakeTmp\cmTryCompileExec.vcxproj"
(default target) (1) ->

(InvalidPlatformError target) ->

C:\Program Files (x86)\MSBuild\Microsoft.Cpp\v4.0\Microsoft.Cpp.InvalidPlatform.Targets(23,7): error MSB8007: The Platform for project 'cmTryCompileExec.vcxproj' is invalid. Platform='x64'. You may be seeing this message because you are trying to build a project without a solution file, and have specified a non-default Platform that doesn't exist for this project. [C:\Users\pedro\Desktop\Servidor\Compilado\CMakeFiles\CMakeTmp\cmTryCompileExec.vcxproj]



0 Warning(s)
1 Error(s)



Time Elapsed 00:00:00.11





CMake will not be able to correctly generate this project.
Call Stack (most recent call first):
CMakeLists.txt:12 (project)



Configuring incomplete, errors occurred!

Meu sistema e 64 bits
Meu processador e 2.80ghz

pedroh7


Mensagens : 42
Pontos : 105

Ver perfil do usuário

Voltar ao Topo Ir em baixo

Re: [Resolvido][Dúvida] Erro na compilaçao

Mensagem por paradox em Qua 4 Jun 2014 - 10:13

Olá, se sua revisão do trinitycore estiver atualizada, você terá que baixar o visual studio 2013 para compilar e certifique-se de que você colocou o compilador correto nas opções do cmake.
Até mais.

paradox


Mensagens : 210
Pontos : 927

Ver perfil do usuário

Voltar ao Topo Ir em baixo

Re: [Resolvido][Dúvida] Erro na compilaçao

Mensagem por pedroh7 em Qua 4 Jun 2014 - 10:37

Porem aqui no cmake nao tem a opçao visual 13
[Você precisa estar registrado e conectado para ver esta imagem.]

pedroh7


Mensagens : 42
Pontos : 105

Ver perfil do usuário

Voltar ao Topo Ir em baixo

Re: [Resolvido][Dúvida] Erro na compilaçao

Mensagem por paradox em Qua 4 Jun 2014 - 10:39

Atualize seu Cmake e utilize a opção visual studio 12


Edit - 

Tópico trancado por falta de feedback do usuário.

paradox


Mensagens : 210
Pontos : 927

Ver perfil do usuário

Voltar ao Topo Ir em baixo

Re: [Resolvido][Dúvida] Erro na compilaçao

Mensagem por Conteúdo patrocinado Hoje à(s) 8:44


Conteúdo patrocinado


Voltar ao Topo Ir em baixo

Ver o tópico anterior Ver o tópico seguinte Voltar ao Topo


 
Permissão deste fórum:
Você não pode responder aos tópicos neste fórum