Bgames
Olá visitante! Seja bem vindo ao nosso fórum!

Para você ter total acesso ao nosso fórum é preciso que você se cadastre.

Cadastre-se Aqui!


PARA VER LINKS E IMAGENS É PRECISO SE REGISTRAR!

[Resolvido][Duvida]Problema no visual c++

Ver o tópico anterior Ver o tópico seguinte Ir em baixo

[Resolvido][Duvida]Problema no visual c++

Mensagem por arphis em Sab 23 Fev 2013 - 1:01

Olá pessoal estou com um erro no visual, nao sei por que esse erro, nao tenho minima ideia

15>Main.obj : error LNK2019: unresolved external symbol _SSLeay_version referenced in function "int __cdecl ace_main_i(int,char * * const)" (?ace_main_i@@YAHHQAPAD@Z)
15>game.lib(Warden.obj) : error LNK2019: unresolved external symbol _SHA1 referenced in function "public: static unsigned int __cdecl Warden::BuildChecksum(unsigned char const *,unsigned int)" (?BuildChecksum@Warden@@SAIPBEI@Z)
15>game.lib(WardenWin.obj) : error LNK2019: unresolved external symbol _MD5_Init referenced in function "public: virtual struct ClientWardenModule * __thiscall WardenWin::GetModuleForClient(void)" (?GetModuleForClient@WardenWin@@UAEPAUClientWardenModule@@XZ)
15>game.lib(WardenWin.obj) : error LNK2019: unresolved external symbol _MD5_Update referenced in function "public: virtual struct ClientWardenModule * __thiscall WardenWin::GetModuleForClient(void)" (?GetModuleForClient@WardenWin@@UAEPAUClientWardenModule@@XZ)
15>game.lib(WardenWin.obj) : error LNK2019: unresolved external symbol _MD5_Final referenced in function "public: virtual struct ClientWardenModule * __thiscall WardenWin::GetModuleForClient(void)" (?GetModuleForClient@WardenWin@@UAEPAUClientWardenModule@@XZ)
15>shared.lib(BigNumber.obj) : error LNK2019: unresolved external symbol _BN_CTX_new referenced in function "public: class BigNumber __thiscall BigNumber::operator*=(class BigNumber const &)" (??XBigNumber@@QAE?AV0@ABV0@@Z)
15>shared.lib(BigNumber.obj) : error LNK2019: unresolved external symbol _BN_CTX_free referenced in function "public: class BigNumber __thiscall BigNumber::operator*=(class BigNumber const &)" (??XBigNumber@@QAE?AV0@ABV0@@Z)
15>shared.lib(BigNumber.obj) : error LNK2019: unresolved external symbol _BN_rand referenced in function "public: void __thiscall BigNumber::SetRand(int)" (?SetRand@BigNumber@@QAEXH@Z)
15>shared.lib(BigNumber.obj) : error LNK2019: unresolved external symbol _BN_num_bits referenced in function "public: unsigned char * __thiscall BigNumber::AsByteArray(int,bool)" (?AsByteArray@BigNumber@@QAEPAEH_N@Z)
15>shared.lib(BigNumber.obj) : error LNK2019: unresolved external symbol _BN_new referenced in function "public: __thiscall BigNumber::BigNumber(unsigned int)" (??0BigNumber@@QAE@I@Z)
15>shared.lib(BigNumber.obj) : error LNK2019: unresolved external symbol _BN_copy referenced in function "public: class BigNumber & __thiscall BigNumber::operator=(class BigNumber const &)" (??4BigNumber@@QAEAAV0@ABV0@@Z)
15>shared.lib(BigNumber.obj) : error LNK2019: unresolved external symbol _BN_bin2bn referenced in function "public: void __thiscall BigNumber::SetBinary(unsigned char const *,int)" (?SetBinary@BigNumber@@QAEXPBEH@Z)
15>shared.lib(BigNumber.obj) : error LNK2019: unresolved external symbol _BN_bn2bin referenced in function "public: unsigned char * __thiscall BigNumber::AsByteArray(int,bool)" (?AsByteArray@BigNumber@@QAEPAEH_N@Z)
15>shared.lib(BigNumber.obj) : error LNK2019: unresolved external symbol _BN_sub referenced in function "public: class BigNumber __thiscall BigNumber::operator-=(class BigNumber const &)" (??ZBigNumber@@QAE?AV0@ABV0@@Z)
15>shared.lib(BigNumber.obj) : error LNK2019: unresolved external symbol _BN_add referenced in function "public: class BigNumber __thiscall BigNumber::operator+=(class BigNumber const &)" (??YBigNumber@@QAE?AV0@ABV0@@Z)
15>shared.lib(BigNumber.obj) : error LNK2019: unresolved external symbol _BN_mul referenced in function "public: class BigNumber __thiscall BigNumber::operator*=(class BigNumber const &)" (??XBigNumber@@QAE?AV0@ABV0@@Z)
15>shared.lib(BigNumber.obj) : error LNK2019: unresolved external symbol _BN_div referenced in function "public: class BigNumber __thiscall BigNumber::operator/=(class BigNumber const &)" (??_0BigNumber@@QAE?AV0@ABV0@@Z)
15>shared.lib(BigNumber.obj) : error LNK2019: unresolved external symbol _BN_add_word referenced in function "public: void __thiscall BigNumber::SetQword(unsigned __int64)" (?SetQword@BigNumber@@QAEX_K@Z)
15>shared.lib(BigNumber.obj) : error LNK2019: unresolved external symbol _BN_set_word referenced in function "public: __thiscall BigNumber::BigNumber(unsigned int)" (??0BigNumber@@QAE@I@Z)
15>shared.lib(BigNumber.obj) : error LNK2019: unresolved external symbol _BN_get_word referenced in function "public: unsigned int __thiscall BigNumber::AsDword(void)" (?AsDword@BigNumber@@QAEIXZ)
15>shared.lib(BigNumber.obj) : error LNK2019: unresolved external symbol _BN_free referenced in function "public: __thiscall BigNumber::~BigNumber(void)" (??1BigNumber@@QAE@XZ)
15>shared.lib(BigNumber.obj) : error LNK2019: unresolved external symbol _BN_lshift referenced in function "public: void __thiscall BigNumber::SetQword(unsigned __int64)" (?SetQword@BigNumber@@QAEX_K@Z)
15>shared.lib(BigNumber.obj) : error LNK2019: unresolved external symbol _BN_exp referenced in function "public: class BigNumber __thiscall BigNumber::Exp(class BigNumber const &)" (?Exp@BigNumber@@QAE?AV1@ABV1@@Z)
15>shared.lib(BigNumber.obj) : error LNK2019: unresolved external symbol _BN_mod_exp referenced in function "public: class BigNumber __thiscall BigNumber::ModExp(class BigNumber const &,class BigNumber const &)" (?ModExp@BigNumber@@QAE?AV1@ABV1@0@Z)
15>shared.lib(BigNumber.obj) : error LNK2019: unresolved external symbol _BN_dup referenced in function "public: __thiscall BigNumber::BigNumber(class BigNumber const &)" (??0BigNumber@@QAE@ABV0@@Z)
15>shared.lib(BigNumber.obj) : error LNK2019: unresolved external symbol _BN_bn2hex referenced in function "public: char * __thiscall BigNumber::AsHexStr(void)const " (?AsHexStr@BigNumber@@QBEPADXZ)
15>shared.lib(BigNumber.obj) : error LNK2019: unresolved external symbol _BN_bn2dec referenced in function "public: char * __thiscall BigNumber::AsDecStr(void)const " (?AsDecStr@BigNumber@@QBEPADXZ)
15>shared.lib(BigNumber.obj) : error LNK2019: unresolved external symbol _BN_hex2bn referenced in function "public: void __thiscall BigNumber::SetHexStr(char const *)" (?SetHexStr@BigNumber@@QAEXPBD@Z)
15>shared.lib(SHA1.obj) : error LNK2019: unresolved external symbol _SHA1_Init referenced in function "public: __thiscall SHA1Hash::SHA1Hash(void)" (??0SHA1Hash@@QAE@XZ)
15>shared.lib(SHA1.obj) : error LNK2019: unresolved external symbol _SHA1_Update referenced in function "public: void __cdecl SHA1Hash::UpdateBigNumbers(class BigNumber *,...)" (?UpdateBigNumbers@SHA1Hash@@QAAXPAVBigNumber@@ZZ)
15>shared.lib(SHA1.obj) : error LNK2019: unresolved external symbol _SHA1_Final referenced in function "public: void __thiscall SHA1Hash::Finalize(void)" (?Finalize@SHA1Hash@@QAEXXZ)
15>shared.lib(ARC4.obj) : error LNK2019: unresolved external symbol _EVP_EncryptInit_ex referenced in function "public: __thiscall ARC4::ARC4(unsigned char)" (??0ARC4@@QAE@E@Z)
15>shared.lib(ARC4.obj) : error LNK2019: unresolved external symbol _EVP_EncryptUpdate referenced in function "public: void __thiscall ARC4::UpdateData(int,unsigned char *)" (?UpdateData@ARC4@@QAEXHPAE@Z)
15>shared.lib(ARC4.obj) : error LNK2019: unresolved external symbol _EVP_EncryptFinal_ex referenced in function "public: void __thiscall ARC4::UpdateData(int,unsigned char *)" (?UpdateData@ARC4@@QAEXHPAE@Z)
15>shared.lib(ARC4.obj) : error LNK2019: unresolved external symbol _EVP_CIPHER_CTX_init referenced in function "public: __thiscall ARC4::ARC4(unsigned char)" (??0ARC4@@QAE@E@Z)
15>shared.lib(ARC4.obj) : error LNK2019: unresolved external symbol _EVP_CIPHER_CTX_cleanup referenced in function "public: __thiscall ARC4::~ARC4(void)" (??1ARC4@@QAE@XZ)
15>shared.lib(ARC4.obj) : error LNK2019: unresolved external symbol _EVP_CIPHER_CTX_set_key_length referenced in function "public: __thiscall ARC4::ARC4(unsigned char)" (??0ARC4@@QAE@E@Z)
15>shared.lib(ARC4.obj) : error LNK2019: unresolved external symbol _EVP_rc4 referenced in function "public: __thiscall ARC4::ARC4(unsigned char)" (??0ARC4@@QAE@E@Z)
15>shared.lib(HMACSHA1.obj) : error LNK2019: unresolved external symbol _EVP_sha1 referenced in function "public: __thiscall HmacHash::HmacHash(unsigned int,unsigned char *)" (??0HmacHash@@QAE@IPAE@Z)
15>shared.lib(HMACSHA1.obj) : error LNK2019: unresolved external symbol _HMAC_CTX_init referenced in function "public: __thiscall HmacHash::HmacHash(unsigned int,unsigned char *)" (??0HmacHash@@QAE@IPAE@Z)
15>shared.lib(HMACSHA1.obj) : error LNK2019: unresolved external symbol _HMAC_CTX_cleanup referenced in function "public: __thiscall HmacHash::~HmacHash(void)" (??1HmacHash@@QAE@XZ)
15>shared.lib(HMACSHA1.obj) : error LNK2019: unresolved external symbol _HMAC_Init_ex referenced in function "public: __thiscall HmacHash::HmacHash(unsigned int,unsigned char *)" (??0HmacHash@@QAE@IPAE@Z)
15>shared.lib(HMACSHA1.obj) : error LNK2019: unresolved external symbol _HMAC_Update referenced in function "public: unsigned char * __thiscall HmacHash::ComputeHash(class BigNumber *)" (?ComputeHash@HmacHash@@QAEPAEPAVBigNumber@@@Z)
15>shared.lib(HMACSHA1.obj) : error LNK2019: unresolved external symbol _HMAC_Final referenced in function "public: void __thiscall HmacHash::Finalize(void)" (?Finalize@HmacHash@@QAEXXZ)
15>C:\Users\Rodrigo\Desktop\build\bin\Release\worldserver.exe : fatal error LNK1120: 44 unresolved externals
16>------ Build started: Project: ALL_BUILD, Configuration: Release Win32 ------
16> Building Custom Rule C:/Users/Rodrigo/Desktop/TrinityCore/CMakeLists.txt
16> CMake does not need to re-run because C:\Users\Rodrigo\Desktop\build\CMakeFiles\generate.stamp is up-to-date.
16> Build all projects
17>------ Skipped Build: Project: INSTALL, Configuration: Release Win32 ------
17>Project not selected to build for this solution configuration
========== Build: 13 succeeded, 3 failed, 0 up-to-date, 1 skipped ==========
Este ai acima é todo erro
Obs: tentei baixar tudo de novo pra compilar direto, mais deu o mesmo erro!
[Você precisa estar registrado e conectado para ver este link.]


Última edição por arphis em Sab 23 Fev 2013 - 8:21, editado 1 vez(es)

arphis


Mensagens : 13
Pontos : 189

Ver perfil do usuário

Voltar ao Topo Ir em baixo

Re: [Resolvido][Duvida]Problema no visual c++

Mensagem por Legendarios em Sab 23 Fev 2013 - 1:04

========== Build: 13 succeeded, 3 failed, 0 up-to-date, 1 skipped ========== Tente Compilar Pelo Visual Studio

Legendarios


Mensagens : 537
Pontos : 273

Ver perfil do usuário

Voltar ao Topo Ir em baixo

Re: [Resolvido][Duvida]Problema no visual c++

Mensagem por arphis em Sab 23 Fev 2013 - 8:34

Ja compilei com ele msm e não adiantou, erro

arphis


Mensagens : 13
Pontos : 189

Ver perfil do usuário

Voltar ao Topo Ir em baixo

Re: [Resolvido][Duvida]Problema no visual c++

Mensagem por Nitro em Sab 23 Fev 2013 - 9:01

apaga a pasta toda e refaz o procedimento

Nitro


Mensagens : 433
Pontos : 726

Ver perfil do usuário

Voltar ao Topo Ir em baixo

Re: [Resolvido][Duvida]Problema no visual c++

Mensagem por arphis em Sab 23 Fev 2013 - 13:07

Como tinhaa falado acima, tentei refazer varias vezes

arphis


Mensagens : 13
Pontos : 189

Ver perfil do usuário

Voltar ao Topo Ir em baixo

Re: [Resolvido][Duvida]Problema no visual c++

Mensagem por Legendarios em Sab 23 Fev 2013 - 16:19

Amigo Tentar Baixa Outro Repositório

Legendarios


Mensagens : 537
Pontos : 273

Ver perfil do usuário

Voltar ao Topo Ir em baixo

Re: [Resolvido][Duvida]Problema no visual c++

Mensagem por arphis em Seg 25 Fev 2013 - 16:41

Pode mover para resolvido,... problema era o seguinte, tava fazendo a parte do cmake com o visual studio 11, mais como meu windows é 7, tinha q ter feito com visual studio 11 64bits, mudei e nao deu mais problema, obrigado pessoal

arphis


Mensagens : 13
Pontos : 189

Ver perfil do usuário

Voltar ao Topo Ir em baixo

Re: [Resolvido][Duvida]Problema no visual c++

Mensagem por Aquilla em Seg 25 Fev 2013 - 17:36



Tópico resolvido e movido para sua área correspondente

Aquilla


Mensagens : 1305
Pontos : 16155

Ver perfil do usuário http://www.google.com.br

Voltar ao Topo Ir em baixo

Re: [Resolvido][Duvida]Problema no visual c++

Mensagem por Conteúdo patrocinado Hoje à(s) 4:39


Conteúdo patrocinado


Voltar ao Topo Ir em baixo

Ver o tópico anterior Ver o tópico seguinte Voltar ao Topo


 
Permissão deste fórum:
Você não pode responder aos tópicos neste fórum